scale-n
type: LexicalEntry
canonical form: scale
sense: 09448485-n
part of speech: noun

scurf-n
type: LexicalEntry
canonical form: scurf
sense: 09448485-n
part of speech: noun

exfoliation-n
type: LexicalEntry
canonical form: exfoliation
sense: 09448485-n
part of speech: noun
sense: 11465849-n

09448485-n
type: LexicalConcept
in scheme: en-word.net
definition: a thin flake of dead epidermis shed from the surface of the skin
ili: i86136
lexfile: noun.object
part of speech: noun
hypernym: 09244958-n

11465849-n
type: LexicalConcept
in scheme: en-word.net
definition: the peeling off in flakes or scales of bark or dead skin
example: exfoliation is increased by sunburn
ili: i97738
lexfile: noun.phenomenon
part of speech: noun
hypernym: 11438864-n