etymological dictionary-n
type: LexicalEntry
canonical form: etymological dictionary
sense: 06431146-n
part of speech: noun

06431146-n
type: LexicalConcept
in scheme: en-word.net
definition: a dictionary giving the historical origins of each word
ili: i70229
lexfile: noun.communication
part of speech: noun
hypernym: 06430544-n