elfin-a
type: LexicalEntry
canonical form: elfin
sense: 01396141-s
part of speech: adjective
sense: 01580203-s
sense: 02129841-s
sense: https://en-word.net/lemma/elfin-a#02730608-a

elflike-a
type: LexicalEntry
canonical form: elflike
sense: 01396141-s
part of speech: adjective

01396141-s
type: LexicalConcept
in scheme: en-word.net
definition: small and delicate
example: she was an elfin creature — graceful and delicate
example: obsessed by things elfin and small
ili: i7586
lexfile: adj.all
part of speech: adjective satellite
similar: https://en-word.net/synset/01394303-a

fey-a
type: LexicalEntry
canonical form: fey
sense: 01580203-s
part of speech: adjective

01580203-s
type: LexicalConcept
in scheme: en-word.net
definition: suggestive of an elf in strangeness and otherworldliness
example: thunderbolts quivered with elfin flares of heat lightning
example: the fey quality was there, the ability to see the moon at midday
  source: John Mason Brown
ili: i8642
lexfile: adj.all
part of speech: adjective satellite
similar: https://en-word.net/synset/01578839-a

elfish-a
type: LexicalEntry
canonical form: elfish
sense: 02129841-s
part of speech: adjective

elvish-a
type: LexicalEntry
canonical form: elvish
sense: 02129841-s
part of speech: adjective

02129841-s
type: LexicalConcept
in scheme: en-word.net
definition: usually good-naturedly mischievous
example: perpetrated a practical joke with elfin delight
example: elvish tricks
ili: i11623
lexfile: adj.all
part of speech: adjective satellite
similar: https://en-word.net/synset/02129139-a

https://en-word.net/synset/02730608-a
type: LexicalConcept
in scheme: en-word.net
definition: relating to or made or done by or as if by an elf
example: elfin bells
example: all the little creatures joined in the elfin dance
ili: i15278
lexfile: adj.pert
part of speech: adjective