relay-n
type: LexicalEntry
canonical form: relay
sense: 04080072-n
part of speech: noun

electrical relay-n
type: LexicalEntry
canonical form: electrical relay
sense: 04080072-n
part of speech: noun

04080072-n
type: LexicalConcept
in scheme: en-word.net
definition: electrical device such that current flowing through it in one circuit can switch on and off a current in a second circuit
ili: i58070
lexfile: noun.artifact
part of speech: noun
hypernym: 03274312-n
mero part: 03281090-n