economy-n
type: LexicalEntry
canonical form: economy
sense: 00193462-n
part of speech: noun
sense: 04900982-n
sense: 05652572-n
sense: 08383680-n

saving-n
type: LexicalEntry
canonical form: saving
sense: 00193462-n
part of speech: noun

00193462-n
type: LexicalConcept
in scheme: en-word.net
definition: an act of economizing; reduction in cost
example: it was a small economy to walk to work every day
example: there was a saving of 50 cents
ili: i36423
lexfile: noun.act
part of speech: noun
hypernym: 00038116-n

thriftiness-n
type: LexicalEntry
canonical form: thriftiness
sense: 04900982-n
part of speech: noun

04900982-n
type: LexicalConcept
in scheme: en-word.net
definition: frugality in the expenditure of money or resources
example: the Scots are famous for their economy
ili: i62704
lexfile: noun.attribute
part of speech: noun
hypernym: 04900553-n

05652572-n
type: LexicalConcept
in scheme: en-word.net
definition: the efficient use of resources
example: economy of effort
ili: i66583
lexfile: noun.cognition
part of speech: noun
hypernym: 05652372-n

economic system-n
type: LexicalEntry
canonical form: economic system
sense: 08383680-n
part of speech: noun

08383680-n
type: LexicalConcept
in scheme: en-word.net
definition: the system of production and distribution and consumption
ili: i81079
lexfile: noun.group
part of speech: noun
hypernym: 08452398-n
mero part: 07983333-n
mero part: 08381475-n