ecclesiastical-a
type: LexicalEntry
canonical form: ecclesiastical
sense: https://en-word.net/lemma/ecclesiastical-a#02910738-a
part of speech: adjective

ecclesiastic-a
type: LexicalEntry
canonical form: ecclesiastic
sense: https://en-word.net/lemma/ecclesiastic-a#02910738-a
part of speech: adjective

https://en-word.net/synset/02910738-a
type: LexicalConcept
in scheme: en-word.net
definition: of or associated with a church (especially a Christian Church)
example: ecclesiastic history
ili: i16498
lexfile: adj.pert
part of speech: adjective