duty-n
type: LexicalEntry
canonical form: duty
sense: 00720746-n
part of speech: noun
sense: 01132241-n
sense: 13337021-n

00720746-n
type: LexicalConcept
in scheme: en-word.net
definition: work that you are obliged to perform for moral or legal reasons
example: the duties of the job
ili: i39216
lexfile: noun.act
part of speech: noun
hypernym: 00576778-n

responsibility-n
type: LexicalEntry
canonical form: responsibility
sense: 01132241-n
part of speech: noun

obligation-n
type: LexicalEntry
canonical form: obligation
sense: 01132241-n
part of speech: noun

01132241-n
type: LexicalConcept
in scheme: en-word.net
definition: the social force that binds you to the courses of action demanded by that force
example: we must instill a sense of duty in our children
example: every right implies a responsibility; every opportunity, an obligation; every possession, a duty
  source: John D.Rockefeller Jr
ili: i41323
lexfile: noun.act
part of speech: noun
hypernym: 01125919-n

tariff-n
type: LexicalEntry
canonical form: tariff
sense: 13337021-n
part of speech: noun

13337021-n
type: LexicalConcept
in scheme: en-word.net
definition: a government tax on imports or exports
example: they signed a treaty to lower duties on trade between their countries
ili: i106669
lexfile: noun.possession
part of speech: noun
hypernym: 13334921-n