due-r
type: LexicalEntry
canonical form: due
sense: 00052690-r
part of speech: adverb

00052690-r
type: LexicalConcept
in scheme: en-word.net
definition: directly or exactly; straight
example: went due North
ili: i18444
lexfile: adv.all
part of speech: adverb

due-a
type: LexicalEntry
canonical form: due
sense: https://en-word.net/lemma/due-a#00137425-a
part of speech: adjective
sense: https://en-word.net/lemma/due-a#00138993-a
sense: 00173133-s
sense: 00933157-s

https://en-word.net/synset/00137425-a
type: LexicalConcept
in scheme: en-word.net
definition: owed and payable immediately or on demand
example: payment is due
ili: i728
lexfile: adj.all
part of speech: adjective
also: https://en-word.net/synset/01714268-a
similar: 00137678-s
similar: 00137816-s
similar: 00137973-s
similar: 00138209-s
similar: 00138366-s
similar: 00138462-s
similar: 00138641-s
similar: 00138769-s

https://en-word.net/synset/00138993-a
type: LexicalConcept
in scheme: en-word.net
definition: suitable to or expected in the circumstances
example: all due respect
example: due cause to honor them
example: a long due promotion
example: in due course
example: due esteem
example: exercising due care
ili: i737
lexfile: adj.all
part of speech: adjective

ascribable-a
type: LexicalEntry
canonical form: ascribable
sense: 00173133-s
part of speech: adjective

imputable-a
type: LexicalEntry
canonical form: imputable
sense: 00173133-s
part of speech: adjective

referable-a
type: LexicalEntry
canonical form: referable
sense: 00173133-s
part of speech: adjective

00173133-s
type: LexicalConcept
in scheme: en-word.net
definition: capable of being assigned or credited to
example: punctuation errors ascribable to careless proofreading
example: the cancellation of the concert was due to the rain
example: the oversight was not imputable to him
ili: i927
lexfile: adj.all
part of speech: adjective satellite
similar: https://en-word.net/synset/00172851-a

00933157-s
type: LexicalConcept
in scheme: en-word.net
definition: scheduled to arrive
example: the train is due in 15 minutes
ili: i5095
lexfile: adj.all
part of speech: adjective satellite
similar: https://en-word.net/synset/00932808-a

due-n
type: LexicalEntry
canonical form: due
sense: 05183609-n
part of speech: noun
sense: 13418034-n

05183609-n
type: LexicalConcept
in scheme: en-word.net
definition: that which is deserved or owed
example: give the devil his due
ili: i64177
lexfile: noun.attribute
part of speech: noun
hypernym: 05182180-n

13418034-n
type: LexicalConcept
in scheme: en-word.net
definition: a payment that is due (e.g., as the price of membership)
example: the society dropped him for non-payment of dues
ili: i107137
lexfile: noun.possession
part of speech: noun
hypernym: 13339169-n