duckweed-n
type: LexicalEntry
canonical form: duckweed
sense: 11814988-n
part of speech: noun

11814988-n
type: LexicalConcept
in scheme: en-word.net
definition: any small or minute aquatic plant of the family Lemnaceae that float on or near the surface of shallow ponds
ili: i99281
lexfile: noun.plant
part of speech: noun
hypernym: 13142303-n