dry-v
type: LexicalEntry
canonical form: dry
sense: 00218901-v
part of speech: verb
sense: 00219829-v

dry out-v
type: LexicalEntry
canonical form: dry out
sense: 00218901-v
part of speech: verb
sense: 00219829-v

00218901-v
type: LexicalConcept
in scheme: en-word.net
definition: remove the moisture from and make dry
example: dry clothes
example: dry hair
ili: i22813
lexfile: verb.change
part of speech: verb
causes: 00219829-v
hypernym: 00126072-v

00219829-v
type: LexicalConcept
in scheme: en-word.net
definition: become dry or drier
example: The laundry dries in the sun
ili: i22818
lexfile: verb.change
part of speech: verb
hypernym: 00109468-v

dry-a
type: LexicalEntry
canonical form: dry
sense: 00803524-s
part of speech: adjective
sense: 00860574-s
sense: 01162344-s
sense: https://en-word.net/lemma/dry-a#01182213-a
sense: 01269202-s
sense: 01797482-s
sense: 01797615-s
sense: 01873002-s
sense: 02268486-s
sense: 02315409-s
sense: https://en-word.net/lemma/dry-a#02376353-a
sense: 02483551-s
sense: https://en-word.net/lemma/dry-a#02562150-a
sense: https://en-word.net/lemma/dry-a#02565316-a
sense: https://en-word.net/lemma/dry-a#02565710-a
sense: https://en-word.net/lemma/dry-a#02566037-a

teetotal-a
type: LexicalEntry
canonical form: teetotal
sense: 00803524-s
part of speech: adjective

00803524-s
type: LexicalConcept
in scheme: en-word.net
definition: practicing complete abstinence from alcoholic beverages
example: he's been dry for ten years
example: no thank you, I happen to be teetotal
ili: i4403
lexfile: adj.all
part of speech: adjective satellite
similar: https://en-word.net/synset/00803088-a

00860574-s
type: LexicalConcept
in scheme: en-word.net
definition: lacking warmth or emotional involvement
example: a dry greeting
example: a dry reading of the lines
example: a dry critique
ili: i4707
lexfile: adj.all
part of speech: adjective satellite
similar: https://en-word.net/synset/00860047-a

01162344-s
type: LexicalConcept
in scheme: en-word.net
definition: having a large proportion of strong liquor
example: a very dry martini is almost straight gin
ili: i6339
lexfile: adj.all
part of speech: adjective satellite
similar: https://en-word.net/synset/01162103-a

https://en-word.net/synset/01182213-a
type: LexicalConcept
in scheme: en-word.net
definition: without a mucous or watery discharge
example: a dry cough
example: that rare thing in the wintertime: a small child with a dry nose
ili: i6446
lexfile: adj.all
part of speech: adjective

ironic-a
type: LexicalEntry
canonical form: ironic
sense: 01269202-s
part of speech: adjective

ironical-a
type: LexicalEntry
canonical form: ironical
sense: 01269202-s
part of speech: adjective

wry-a
type: LexicalEntry
canonical form: wry
sense: 01269202-s
part of speech: adjective

01269202-s
type: LexicalConcept
in scheme: en-word.net
definition: humorously sarcastic or mocking
example: dry humor
example: an ironic remark often conveys an intended meaning obliquely
example: an ironic novel
example: an ironical smile
example: with a wry Scottish wit
ili: i6916
lexfile: adj.all
part of speech: adjective satellite
similar: https://en-word.net/synset/01267446-a

01797482-s
type: LexicalConcept
in scheme: en-word.net
definition: (of food) eaten without a spread or sauce or other garnish
example: dry toast
example: dry meat
ili: i9849
lexfile: adj.all
part of speech: adjective satellite
similar: https://en-word.net/synset/01796420-a

01797615-s
type: LexicalConcept
in scheme: en-word.net
definition: having no adornment or coloration
example: dry facts
example: rattled off the facts in a dry mechanical manner
ili: i9850
lexfile: adj.all
part of speech: adjective satellite
similar: https://en-word.net/synset/01796420-a

01873002-s
type: LexicalConcept
in scheme: en-word.net
definition: unproductive especially of the expected results
example: a dry run
example: a mind dry of new ideas
ili: i10250
lexfile: adj.all
part of speech: adjective satellite
similar: https://en-word.net/synset/01872485-a

02268486-s
type: LexicalConcept
in scheme: en-word.net
definition: used of solid substances in contrast with liquid ones
example: dry weight
ili: i12513
lexfile: adj.all
part of speech: adjective satellite
similar: https://en-word.net/synset/02267791-a

juiceless-a
type: LexicalEntry
canonical form: juiceless
sense: 02315409-s
part of speech: adjective

02315409-s
type: LexicalConcept
in scheme: en-word.net
definition: lacking interest or stimulation; dull and lifeless
example: a dry book
example: a dry lecture filled with trivial details
example: dull and juiceless as only book knowledge can be when it is unrelated to … life
  source: John Mason Brown
ili: i12779
lexfile: adj.all
part of speech: adjective satellite
similar: https://en-word.net/synset/02315047-a

https://en-word.net/synset/02376353-a
type: LexicalConcept
in scheme: en-word.net
definition: (of liquor) having a low residual sugar content because of decomposition of sugar during fermentation
example: a dry white burgundy
example: a dry Bordeaux
ili: i13113
lexfile: adj.all
part of speech: adjective
also: https://en-word.net/synset/02377355-a
also: https://en-word.net/synset/02346397-a
similar: 02376636-s
similar: 02376715-s
similar: 02376815-s

02483551-s
type: LexicalConcept
in scheme: en-word.net
definition: not shedding tears
example: dry sobs
example: with dry eyes
ili: i13710
lexfile: adj.all
part of speech: adjective satellite
similar: https://en-word.net/synset/02483452-a

https://en-word.net/synset/02562150-a
type: LexicalConcept
in scheme: en-word.net
definition: free from liquid or moisture; lacking natural or normal moisture or depleted of water; or no longer wet
example: dry land
example: dry clothes
example: a dry climate
example: dry splintery boards
example: a dry river bed
example: the paint is dry
ili: i14155
lexfile: adj.all
part of speech: adjective
attribute: 14558298-n
similar: 02562716-s
similar: 02562992-s
similar: 02563085-s
similar: 02563185-s
similar: 02563416-s
similar: 02563619-s
similar: 02563787-s
similar: 02563907-s
similar: 02564004-s
similar: 02564330-s
similar: 02564495-s
similar: 02564567-s
similar: 02564672-s
similar: 02564789-s
similar: 02564910-s

https://en-word.net/synset/02565316-a
type: LexicalConcept
in scheme: en-word.net
definition: not producing milk
example: a dry cow
ili: i14173
lexfile: adj.all
part of speech: adjective
similar: 02565433-s

https://en-word.net/synset/02565710-a
type: LexicalConcept
in scheme: en-word.net
definition: opposed to or prohibiting the production and sale of alcoholic beverages
example: the dry vote led by preachers and bootleggers
example: a dry state
ili: i14176
lexfile: adj.all
part of speech: adjective

https://en-word.net/synset/02566037-a
type: LexicalConcept
in scheme: en-word.net
definition: lacking moisture or volatile components
example: dry paint
ili: i14178
lexfile: adj.all
part of speech: adjective

dry-n
type: LexicalEntry
canonical form: dry
sense: 10057647-n
part of speech: noun

prohibitionist-n
type: LexicalEntry
canonical form: prohibitionist
sense: 10057647-n
part of speech: noun

10057647-n
type: LexicalConcept
in scheme: en-word.net
definition: a reformer who opposes the use of intoxicating beverages
ili: i89646
lexfile: noun.person
part of speech: noun
hypernym: 10534787-n