dragon-n
type: LexicalEntry
canonical form: dragon
sense: 01691230-n
part of speech: noun
sense: 09517519-n
sense: 10049454-n

flying dragon-n
type: LexicalEntry
canonical form: flying dragon
sense: 01691230-n
part of speech: noun

flying lizard-n
type: LexicalEntry
canonical form: flying lizard
sense: 01691230-n
part of speech: noun

01691230-n
type: LexicalConcept
in scheme: en-word.net
definition: any of several small tropical Asian lizards capable of gliding by spreading winglike membranes on each side of the body
ili: i44178
lexfile: noun.animal
part of speech: noun
hypernym: 01690306-n

European dragon-n
type: LexicalEntry
canonical form: European dragon
sense: 09517519-n
part of speech: noun

firedrake-n
type: LexicalEntry
canonical form: firedrake
sense: 09517519-n
part of speech: noun

09517519-n
type: LexicalConcept
in scheme: en-word.net
definition: a creature of Teutonic mythology; usually represented as breathing fire and having a reptilian body and sometimes wings
ili: i86512
lexfile: noun.person
part of speech: noun
hypernym: 09515254-n

tartar-n
type: LexicalEntry
canonical form: tartar
sense: 10049454-n
part of speech: noun

10049454-n
type: LexicalConcept
in scheme: en-word.net
definition: a fiercely vigilant and unpleasant woman
ili: i89608
lexfile: noun.person
part of speech: noun
exemplifies: 06730109-n
hypernym: 09654651-n