trawl-n
type: LexicalEntry
canonical form: trawl
sense: 04482984-n
part of speech: noun

dragnet-n
type: LexicalEntry
canonical form: dragnet
sense: 04482984-n
part of speech: noun
sense: 08450871-n

trawl net-n
type: LexicalEntry
canonical form: trawl net
sense: 04482984-n
part of speech: noun

04482984-n
type: LexicalConcept
in scheme: en-word.net
definition: a conical fishnet dragged through the water at great depths
ili: i60500
lexfile: noun.artifact
part of speech: noun
hypernym: 03357474-n

08450871-n
type: LexicalConcept
in scheme: en-word.net
definition: a system of coordinated measures for apprehending (criminals or other individuals)
example: caught in the police dragnet
ili: i81443
lexfile: noun.group
part of speech: noun
hypernym: 08452398-n