downside-n
type: LexicalEntry
canonical form: downside
sense: 05861384-n
part of speech: noun

05861384-n
type: LexicalConcept
in scheme: en-word.net
definition: a negative aspect of something that is generally positive
example: there is a downside even to motherhood
ili: i67628
lexfile: noun.cognition
part of speech: noun
hypernym: 05861118-n