latch-n
type: LexicalEntry
canonical form: latch
sense: 03650325-n
part of speech: noun

door latch-n
type: LexicalEntry
canonical form: door latch
sense: 03650325-n
part of speech: noun

03650325-n
type: LexicalConcept
in scheme: en-word.net
definition: spring-loaded doorlock that can only be opened from the outside with a key
ili: i55553
lexfile: noun.artifact
part of speech: noun
hypernym: 03687813-n