kennel-n
type: LexicalEntry
canonical form: kennel
sense: 03615737-n
part of speech: noun

doghouse-n
type: LexicalEntry
canonical form: doghouse
sense: 03615737-n
part of speech: noun
sense: 06210664-n

dog house-n
type: LexicalEntry
canonical form: dog house
sense: 03615737-n
part of speech: noun

03615737-n
type: LexicalConcept
in scheme: en-word.net
definition: outbuilding that serves as a shelter for a dog
ili: i55345
lexfile: noun.artifact
part of speech: noun
hypernym: 03864800-n
hypernym: 04198986-n

06210664-n
type: LexicalConcept
in scheme: en-word.net
definition: an idiomatic term for being in disfavor
example: in the doghouse
ili: i69116
lexfile: noun.cognition
part of speech: noun
hypernym: 06210476-n