docket-v
type: LexicalEntry
canonical form: docket
sense: 01010573-v
part of speech: verb
sense: 01010746-v

01010573-v
type: LexicalConcept
in scheme: en-word.net
definition: make a summary or abstract of a legal document and inscribe it in a list
ili: i26628
lexfile: verb.communication
part of speech: verb
domain topic: 08458195-n
hypernym: 01009951-v

01010746-v
type: LexicalConcept
in scheme: en-word.net
definition: place on the docket for legal action
example: Only 5 of the 120 cases docketed were tried
ili: i26629
lexfile: verb.communication
part of speech: verb
domain topic: 08458195-n
hypernym: 01496967-v

agenda-n
type: LexicalEntry
canonical form: agenda
sense: 05919534-n
part of speech: noun

docket-n
type: LexicalEntry
canonical form: docket
sense: 05919534-n
part of speech: noun
sense: 06497282-n

schedule-n
type: LexicalEntry
canonical form: schedule
sense: 05919534-n
part of speech: noun

05919534-n
type: LexicalConcept
in scheme: en-word.net
definition: a temporally organized plan for matters to be attended to
ili: i67903
lexfile: noun.cognition
part of speech: noun
hypernym: 05907175-n

06497282-n
type: LexicalConcept
in scheme: en-word.net
definition: (law) the calendar of a court; the list of cases to be tried or a summary of the court's activities
ili: i70530
lexfile: noun.communication
part of speech: noun
domain topic: 08458195-n
hypernym: 06499232-n