dissimilate-v
type: LexicalEntry
canonical form: dissimilate
sense: 00160461-v
part of speech: verb
sense: 00160688-v
sense: 00160820-v

00160461-v
type: LexicalConcept
in scheme: en-word.net
definition: become dissimilar or less similar
example: These two related tribes of people gradually dissimilated over time
ili: i22512
lexfile: verb.change
part of speech: verb
hypernym: 00109468-v

00160688-v
type: LexicalConcept
in scheme: en-word.net
definition: make dissimilar; cause to become less similar
ili: i22513
lexfile: verb.change
part of speech: verb
hypernym: 00126072-v

00160820-v
type: LexicalConcept
in scheme: en-word.net
definition: become dissimilar by changing the sound qualities
example: These consonants dissimilate
ili: i22514
lexfile: verb.change
part of speech: verb
domain topic: 06186749-n
hypernym: 00109468-v