direct-a
type: LexicalEntry
canonical form: direct
sense: 00005472-s
part of speech: adjective
sense: https://en-word.net/lemma/direct-a#00764460-a
sense: https://en-word.net/lemma/direct-a#00767176-a
sense: https://en-word.net/lemma/direct-a#00767444-a
sense: https://en-word.net/lemma/direct-a#00772799-a
sense: https://en-word.net/lemma/direct-a#00773485-a
sense: 00774039-s
sense: 00917922-s
sense: https://en-word.net/lemma/direct-a#01419359-a
sense: 01858594-s

exact-a
type: LexicalEntry
canonical form: exact
sense: 00005472-s
part of speech: adjective

00005472-s
type: LexicalConcept
in scheme: en-word.net
definition: lacking compromising or mitigating elements
example: the direct opposite
ili: i23
lexfile: adj.all
part of speech: adjective satellite
similar: https://en-word.net/synset/00005204-a

directly-r
type: LexicalEntry
canonical form: directly
sense: 00052386-r
part of speech: adverb

straight-r
type: LexicalEntry
canonical form: straight
sense: 00052386-r
part of speech: adverb

direct-r
type: LexicalEntry
canonical form: direct
sense: 00052386-r
part of speech: adverb

00052386-r
type: LexicalConcept
in scheme: en-word.net
definition: without deviation
example: the path leads directly to the lake
example: went direct to the office
ili: i18442
lexfile: adv.all
part of speech: adverb

mastermind-v
type: LexicalEntry
canonical form: mastermind
sense: 00711834-v
part of speech: verb

engineer-v
type: LexicalEntry
canonical form: engineer
sense: 00711834-v
part of speech: verb

direct-v
type: LexicalEntry
canonical form: direct
sense: 00711834-v
part of speech: verb
sense: 00714920-v
sense: 00751211-v
sense: 00751382-v
sense: 00992844-v
sense: 01153025-v
sense: 01153576-v
sense: 01714176-v
sense: 01736802-v
sense: 01935739-v
sense: 01955339-v
sense: 02003830-v
sense: 02444366-v

organize-v
type: LexicalEntry
canonical form: organize
sense: 00711834-v
part of speech: verb

organise-v
type: LexicalEntry
canonical form: organise
sense: 00711834-v
part of speech: verb

orchestrate-v
type: LexicalEntry
canonical form: orchestrate
sense: 00711834-v
part of speech: verb

00711834-v
type: LexicalConcept
in scheme: en-word.net
definition: plan and direct (a complex undertaking)
example: he masterminded the robbery
ili: i25255
lexfile: verb.cognition
part of speech: verb
hypernym: 00706456-v

calculate-v
type: LexicalEntry
canonical form: calculate
sense: 00714920-v
part of speech: verb

aim-v
type: LexicalEntry
canonical form: aim
sense: 00714920-v
part of speech: verb
sense: 01153025-v
sense: 01153576-v

00714920-v
type: LexicalConcept
in scheme: en-word.net
definition: specifically design a product, event, or activity for a certain public
ili: i25270
lexfile: verb.cognition
part of speech: verb
hypernym: 00711208-v

00751211-v
type: LexicalConcept
in scheme: en-word.net
definition: command with authority
example: He directed the children to do their homework
ili: i25444
lexfile: verb.communication
part of speech: verb
hypernym: 00748704-v

00751382-v
type: LexicalConcept
in scheme: en-word.net
definition: give directions to; point somebody into a certain direction
example: I directed them towards the town hall
ili: i25445
lexfile: verb.communication
part of speech: verb
hypernym: 00832735-v

https://en-word.net/synset/00764460-a
type: LexicalConcept
in scheme: en-word.net
definition: direct in spatial dimensions; proceeding without deviation or interruption; straight and short
example: a direct route
example: a direct flight
example: a direct hit
ili: i4206
lexfile: adj.all
part of speech: adjective
also: https://en-word.net/synset/02318575-a
attribute: 04925387-n
similar: 00764804-s
similar: 00764992-s
similar: 00765135-s
similar: 00765277-s
similar: 00765387-s
similar: 00765711-s

https://en-word.net/synset/00767176-a
type: LexicalConcept
in scheme: en-word.net
definition: (of a current) flowing in one direction only
example: direct current
ili: i4218
lexfile: adj.all
part of speech: adjective
domain topic: 11470244-n

https://en-word.net/synset/00767444-a
type: LexicalConcept
in scheme: en-word.net
definition: straightforward in means or manner or behavior or language or action
example: a direct question
example: a direct response
example: a direct approach
ili: i4220
lexfile: adj.all
part of speech: adjective
also: https://en-word.net/synset/01225031-a
similar: 00767844-s
similar: 00768027-s
similar: 00768716-s
similar: 00768832-s
similar: 00768970-s
similar: 00769097-s
similar: 00769226-s
similar: 00769422-s
similar: 00769662-s
similar: 00769908-s

https://en-word.net/synset/00772799-a
type: LexicalConcept
in scheme: en-word.net
definition: similar in nature or effect or relation to another quantity
example: a term is in direct proportion to another term if it increases (or decreases) as the other increases (or decreases)
ili: i4241
lexfile: adj.all
part of speech: adjective
domain topic: 06009822-n

https://en-word.net/synset/00773485-a
type: LexicalConcept
in scheme: en-word.net
definition: moving from west to east on the celestial sphere; or — for planets — around the sun in the same direction as the Earth
ili: i4244
lexfile: adj.all
part of speech: adjective
domain topic: 06104629-n

unmediated-a
type: LexicalEntry
canonical form: unmediated
sense: 00774039-s
part of speech: adjective

00774039-s
type: LexicalConcept
in scheme: en-word.net
definition: having no intervening persons, agents, conditions
example: in direct sunlight
example: in direct contact with the voters
example: direct exposure to the disease
example: a direct link
example: the direct cause of the accident
example: direct vote
ili: i4247
lexfile: adj.all
part of speech: adjective satellite
similar: https://en-word.net/synset/00773875-a

verbatim-a
type: LexicalEntry
canonical form: verbatim
sense: 00917922-s
part of speech: adjective

00917922-s
type: LexicalConcept
in scheme: en-word.net
definition: in precisely the same words used by a writer or speaker
example: a direct quotation
example: repeated their dialog verbatim
ili: i5007
lexfile: adj.all
part of speech: adjective satellite
similar: https://en-word.net/synset/00917535-a

address-v
type: LexicalEntry
canonical form: address
sense: 00992844-v
part of speech: verb

00992844-v
type: LexicalConcept
in scheme: en-word.net
definition: put an address on (an envelope)
ili: i26537
lexfile: verb.communication
part of speech: verb
hypernym: 01031885-v

target-v
type: LexicalEntry
canonical form: target
sense: 01153025-v
part of speech: verb

place-v
type: LexicalEntry
canonical form: place
sense: 01153025-v
part of speech: verb

point-v
type: LexicalEntry
canonical form: point
sense: 01153025-v
part of speech: verb
sense: 01935739-v

01153025-v
type: LexicalConcept
in scheme: en-word.net
definition: intend (something) to move towards a certain goal
example: He aimed his fists towards his opponent's face
example: criticism directed at her superior
example: direct your anger towards others, not towards yourself
ili: i27377
lexfile: verb.competition
part of speech: verb
hypernym: 01153576-v

take-v
type: LexicalEntry
canonical form: take
sense: 01153576-v
part of speech: verb
sense: 02003830-v

train-v
type: LexicalEntry
canonical form: train
sense: 01153576-v
part of speech: verb

take aim-v
type: LexicalEntry
canonical form: take aim
sense: 01153576-v
part of speech: verb

01153576-v
type: LexicalConcept
in scheme: en-word.net
definition: point or cause to go (blows, weapons, or objects such as photographic equipment) towards
example: Please don't aim at your little brother!
example: He trained his gun on the burglar
example: Don't train your camera on the women
example: Take a swipe at one's opponent
ili: i27379
lexfile: verb.competition
part of speech: verb
hypernym: 01991174-v

lineal-a
type: LexicalEntry
canonical form: lineal
sense: https://en-word.net/lemma/lineal-a#01419359-a
part of speech: adjective

https://en-word.net/synset/01419359-a
type: LexicalConcept
in scheme: en-word.net
definition: in a straight unbroken line of descent from parent to child
example: lineal ancestors
example: lineal heirs
example: a direct descendant of the king
example: direct heredity
ili: i7728
lexfile: adj.all
part of speech: adjective
also: https://en-word.net/synset/01978302-a
similar: 01419660-s
similar: 01419810-s
similar: 01419956-s

01714176-v
type: LexicalConcept
in scheme: en-word.net
definition: guide the actors in (plays and films)
ili: i30295
lexfile: verb.creation
part of speech: verb
domain topic: 06167042-n
hypernym: 01620211-v

conduct-v
type: LexicalEntry
canonical form: conduct
sense: 01736802-v
part of speech: verb
sense: 02003830-v

lead-v
type: LexicalEntry
canonical form: lead
sense: 01736802-v
part of speech: verb
sense: 02003830-v

01736802-v
type: LexicalConcept
in scheme: en-word.net
definition: lead, as in the performance of a composition
example: conduct an orchestra
example: Barenboim conducted the Chicago symphony for years
ili: i30403
lexfile: verb.creation
part of speech: verb
domain topic: 00544270-n
hypernym: 01716563-v
similar: 01737094-v

01858594-s
type: LexicalConcept
in scheme: en-word.net
definition: being an immediate result or consequence
example: a direct result of the accident
ili: i10177
lexfile: adj.all
part of speech: adjective satellite
similar: https://en-word.net/synset/01858102-a

steer-v
type: LexicalEntry
canonical form: steer
sense: 01935739-v
part of speech: verb

maneuver-v
type: LexicalEntry
canonical form: maneuver
sense: 01935739-v
part of speech: verb

manoeuver-v
type: LexicalEntry
canonical form: manoeuver
sense: 01935739-v
part of speech: verb

manoeuvre-v
type: LexicalEntry
canonical form: manoeuvre
sense: 01935739-v
part of speech: verb

head-v
type: LexicalEntry
canonical form: head
sense: 01935739-v
part of speech: verb

guide-v
type: LexicalEntry
canonical form: guide
sense: 01935739-v
part of speech: verb
sense: 02003830-v

channelize-v
type: LexicalEntry
canonical form: channelize
sense: 01935739-v
part of speech: verb

channelise-v
type: LexicalEntry
canonical form: channelise
sense: 01935739-v
part of speech: verb

01935739-v
type: LexicalConcept
in scheme: en-word.net
definition: direct the course; determine the direction of travelling
ili: i31378
lexfile: verb.motion
part of speech: verb
hypernym: 02445887-v

send-v
type: LexicalEntry
canonical form: send
sense: 01955339-v
part of speech: verb

01955339-v
type: LexicalConcept
in scheme: en-word.net
definition: cause to go somewhere
example: The explosion sent the car flying in the air
example: She sent her children to camp
example: He directed all his energies into his dissertation
ili: i31486
lexfile: verb.motion
part of speech: verb
hypernym: 01854282-v

02003830-v
type: LexicalConcept
in scheme: en-word.net
definition: take somebody somewhere
example: we led him to our chief
example: can you take me to the main entrance?
example: He conducted us to the palace
ili: i31738
lexfile: verb.motion
part of speech: verb
hypernym: 02372362-v

02444366-v
type: LexicalConcept
in scheme: en-word.net
definition: govern or manage
ili: i33923
lexfile: verb.social
part of speech: verb
causes: 02372362-v
hypernym: 02441196-v