dinner-n
type: LexicalEntry
canonical form: dinner
sense: 08270736-n
part of speech: noun

dinner party-n
type: LexicalEntry
canonical form: dinner party
sense: 08270736-n
part of speech: noun

08270736-n
type: LexicalConcept
in scheme: en-word.net
definition: a party of people assembled to have dinner together
example: guests should never be late to a dinner party
ili: i80506
lexfile: noun.group
part of speech: noun
hypernym: 08269523-n