dike-v
type: LexicalEntry
canonical form: dike
sense: 01590739-v
part of speech: verb

dyke-v
type: LexicalEntry
canonical form: dyke
sense: 01590739-v
part of speech: verb

01590739-v
type: LexicalConcept
in scheme: en-word.net
definition: enclose with a dike
example: dike the land to protect it from water
ili: i29668
lexfile: verb.contact
part of speech: verb
hypernym: 01589983-v

dam-n
type: LexicalEntry
canonical form: dam
sense: 03164975-n
part of speech: noun

dike-n
type: LexicalEntry
canonical form: dike
sense: 03164975-n
part of speech: noun
sense: 09903399-n

dyke-n
type: LexicalEntry
canonical form: dyke
sense: 03164975-n
part of speech: noun
sense: 09903399-n

03164975-n
type: LexicalConcept
in scheme: en-word.net
definition: a barrier constructed to contain the flow of water or to keep out the sea
ili: i52691
lexfile: noun.artifact
part of speech: noun
hypernym: 02799782-n

butch-n
type: LexicalEntry
canonical form: butch
sense: 09903399-n
part of speech: noun

09903399-n
type: LexicalConcept
in scheme: en-word.net
definition: (slang) offensive term for a lesbian who is noticeably masculine
ili: i88754
lexfile: noun.person
part of speech: noun
exemplifies: 06730109-n
exemplifies: 07171981-n
exemplifies: 07139048-n
hypernym: 10274662-n