desperation-n
type: LexicalEntry
canonical form: desperation
sense: 04669747-n
part of speech: noun
sense: 14509858-n

04669747-n
type: LexicalConcept
in scheme: en-word.net
definition: desperate recklessness
example: it was a policy of desperation
ili: i61566
lexfile: noun.attribute
part of speech: noun
hypernym: 04669283-n

despair-n
type: LexicalEntry
canonical form: despair
sense: 14509858-n
part of speech: noun

14509858-n
type: LexicalConcept
in scheme: en-word.net
definition: a state in which all hope is lost or absent
example: in the depths of despair
example: they were rescued from despair at the last minute
example: courage born of desperation
ili: i113128
lexfile: noun.state
part of speech: noun
hypernym: 13943868-n