derrick-n
type: LexicalEntry
canonical form: derrick
sense: 03183096-n
part of speech: noun
sense: 03183204-n

03183096-n
type: LexicalConcept
in scheme: en-word.net
definition: a simple crane having lifting tackle slung from a boom
ili: i52805
lexfile: noun.artifact
part of speech: noun
hypernym: 03131358-n

03183204-n
type: LexicalConcept
in scheme: en-word.net
definition: a framework erected over an oil well to allow drill tubes to be raised and lowered
ili: i52806
lexfile: noun.artifact
part of speech: noun
hypernym: 03396616-n