depth-n
type: LexicalEntry
canonical form: depth
sense: 05101987-n
part of speech: noun
sense: 05141618-n
sense: 05141812-n
sense: 05621745-n
sense: 14464549-n

05101987-n
type: LexicalConcept
in scheme: en-word.net
definition: degree of psychological or intellectual profundity
ili: i63765
lexfile: noun.attribute
part of speech: noun
hypernym: 05101152-n

05141618-n
type: LexicalConcept
in scheme: en-word.net
definition: the attribute or quality of being deep, strong, or intense
example: the depth of his breathing
example: the depth of his sighs
example: the depth of his emotion
ili: i63970
lexfile: noun.attribute
part of speech: noun
hypernym: 00024444-n

deepness-n
type: LexicalEntry
canonical form: deepness
sense: 05141812-n
part of speech: noun
sense: 05621745-n

05141812-n
type: LexicalConcept
in scheme: en-word.net
definition: the extent downward or backward or inward
example: the depth of the water
example: depth of a shelf
example: depth of a closet
ili: i63971
lexfile: noun.attribute
part of speech: noun
attribute: https://en-word.net/synset/00693335-a
attribute: https://en-word.net/synset/00694973-a
attribute: https://en-word.net/synset/00696211-a
attribute: https://en-word.net/synset/00696805-a
hypernym: 05130681-n

astuteness-n
type: LexicalEntry
canonical form: astuteness
sense: 05621745-n
part of speech: noun

profundity-n
type: LexicalEntry
canonical form: profundity
sense: 05621745-n
part of speech: noun

profoundness-n
type: LexicalEntry
canonical form: profoundness
sense: 05621745-n
part of speech: noun

05621745-n
type: LexicalConcept
in scheme: en-word.net
definition: the intellectual ability to penetrate deeply into ideas
ili: i66412
lexfile: noun.cognition
part of speech: noun
hypernym: 05624890-n

14464549-n
type: LexicalConcept
in scheme: en-word.net
definition: (usually plural) a low moral state
example: he had sunk to the depths of addiction
ili: i112897
lexfile: noun.state
part of speech: noun
exemplifies: 06306016-n
hypernym: 14464089-n