exile-n
type: LexicalEntry
canonical form: exile
sense: 10090946-n
part of speech: noun

deportee-n
type: LexicalEntry
canonical form: deportee
sense: 10090946-n
part of speech: noun

10090946-n
type: LexicalConcept
in scheme: en-word.net
definition: a person who is expelled from home or country by authority
ili: i89844
lexfile: noun.person
part of speech: noun
hypernym: 10123254-n