cumbersome-a
type: LexicalEntry
canonical form: cumbersome
sense: 02575060-s
part of speech: adjective

cumbrous-a
type: LexicalEntry
canonical form: cumbrous
sense: 02575060-s
part of speech: adjective

02575060-s
type: LexicalConcept
in scheme: en-word.net
definition: difficult to handle or use especially because of size or weight
example: a cumbersome piece of machinery
example: cumbrous protective clothing
ili: i14227
lexfile: adj.all
part of speech: adjective satellite
similar: https://en-word.net/synset/02574457-a