prosecution-n
type: LexicalEntry
canonical form: prosecution
sense: 01200797-n
part of speech: noun

criminal prosecution-n
type: LexicalEntry
canonical form: criminal prosecution
sense: 01200797-n
part of speech: noun

01200797-n
type: LexicalConcept
in scheme: en-word.net
definition: the institution and conduct of legal proceedings against a defendant for criminal behavior
ili: i41666
lexfile: noun.act
part of speech: noun
domain topic: 08458195-n
hypernym: 01184392-n