cress-n
type: LexicalEntry
canonical form: cress
sense: 07748723-n
part of speech: noun
sense: 11889820-n

07748723-n
type: LexicalConcept
in scheme: en-word.net
definition: pungent leaves of any of numerous cruciferous herbs
ili: i77666
lexfile: noun.food
part of speech: noun
hypernym: 07739075-n

cress plant-n
type: LexicalEntry
canonical form: cress plant
sense: 11889820-n
part of speech: noun

11889820-n
type: LexicalConcept
in scheme: en-word.net
definition: any of various plants of the family Cruciferae with edible leaves that have a pungent taste
ili: i99631
lexfile: noun.plant
part of speech: noun
hypernym: 11889283-n