cover-v
type: LexicalEntry
canonical form: cover
sense: 00048350-v
part of speech: verb
sense: 00059956-v
sense: 00892737-v
sense: 00969130-v
sense: 00969487-v
sense: 01035399-v
sense: 01131627-v
sense: 01150762-v
sense: 01151046-v
sense: 01152476-v
sense: 01210571-v
sense: 01335412-v
sense: 01339317-v
sense: 01433080-v
sense: 01585121-v
sense: 01916152-v
sense: 02151539-v
sense: 02152799-v
sense: 02315654-v
sense: 02400142-v
sense: 02400336-v
sense: 02479869-v
sense: 02635874-v
sense: 02678648-v
sense: 02681746-v
sense: 02693758-v

wrap up-v
type: LexicalEntry
canonical form: wrap up
sense: 00048350-v
part of speech: verb

00048350-v
type: LexicalConcept
in scheme: en-word.net
definition: clothe, as if for protection from the elements
example: cover your head!
ili: i22011
lexfile: verb.body
part of speech: verb
hypernym: 00047662-v

brood-v
type: LexicalEntry
canonical form: brood
sense: 00059956-v
part of speech: verb

hatch-v
type: LexicalEntry
canonical form: hatch
sense: 00059956-v
part of speech: verb

incubate-v
type: LexicalEntry
canonical form: incubate
sense: 00059956-v
part of speech: verb

00059956-v
type: LexicalConcept
in scheme: en-word.net
definition: sit on (eggs)
example: Birds brood
example: The female covers the eggs
ili: i22078
lexfile: verb.body
part of speech: verb
entails: 01988916-v
hypernym: 00054856-v
similar: 01433080-v
similar: 00062866-v

insure-v
type: LexicalEntry
canonical form: insure
sense: 00892737-v
part of speech: verb

underwrite-v
type: LexicalEntry
canonical form: underwrite
sense: 00892737-v
part of speech: verb

00892737-v
type: LexicalConcept
in scheme: en-word.net
definition: protect by insurance
example: The insurance won't cover this
ili: i26075
lexfile: verb.communication
part of speech: verb
hypernym: 00893457-v
similar: 02400142-v
similar: 02678648-v

report-v
type: LexicalEntry
canonical form: report
sense: 00969130-v
part of speech: verb

00969130-v
type: LexicalConcept
in scheme: en-word.net
definition: be responsible for reporting the details of, as in journalism
example: Snow reported on China in the 1950's
example: The cub reporter covered New York City
ili: i26432
lexfile: verb.communication
part of speech: verb
hypernym: 00833312-v
similar: 00969487-v

00969487-v
type: LexicalConcept
in scheme: en-word.net
definition: maintain a check on; especially by patrolling
example: The second officer covered the top floor
ili: i26433
lexfile: verb.communication
part of speech: verb
hypernym: 00664507-v
similar: 00969130-v

cover-n
type: LexicalEntry
canonical form: cover
sense: 00990979-n
part of speech: noun
sense: 01051609-n
sense: 01051916-n
sense: 02843848-n
sense: 02852392-n
sense: 03126349-n
sense: 04159023-n
sense: 04461181-n
sense: 09280855-n
sense: 13339433-n

covering fire-n
type: LexicalEntry
canonical form: covering fire
sense: 00990979-n
part of speech: noun

00990979-n
type: LexicalConcept
in scheme: en-word.net
definition: fire that makes it difficult for the enemy to fire on your own individuals or formations
example: artillery provided covering fire for the withdrawal
ili: i40573
lexfile: noun.act
part of speech: noun
hypernym: 00989024-n

treat-v
type: LexicalEntry
canonical form: treat
sense: 01035399-v
part of speech: verb

handle-v
type: LexicalEntry
canonical form: handle
sense: 01035399-v
part of speech: verb

plow-v
type: LexicalEntry
canonical form: plow
sense: 01035399-v
part of speech: verb

deal-v
type: LexicalEntry
canonical form: deal
sense: 01035399-v
part of speech: verb

address-v
type: LexicalEntry
canonical form: address
sense: 01035399-v
part of speech: verb

01035399-v
type: LexicalConcept
in scheme: en-word.net
definition: act on verbally or in some form of artistic expression
example: This book deals with incest
example: The course covered all of Western Civilization
example: The new book treats the history of China
ili: i26742
lexfile: verb.communication
part of speech: verb
hypernym: 00966943-v
similar: 02519853-v
similar: 02635874-v

covering-n
type: LexicalEntry
canonical form: covering
sense: 01051609-n
part of speech: noun
sense: 09280855-n

screening-n
type: LexicalEntry
canonical form: screening
sense: 01051609-n
part of speech: noun

masking-n
type: LexicalEntry
canonical form: masking
sense: 01051609-n
part of speech: noun

01051609-n
type: LexicalConcept
in scheme: en-word.net
definition: the act of concealing the existence of something by obstructing the view of it
example: the cover concealed their guns from enemy aircraft
ili: i40910
lexfile: noun.act
part of speech: noun
hypernym: 01050836-n

01051916-n
type: LexicalConcept
in scheme: en-word.net
definition: a false identity and background (especially one created for an undercover agent)
example: her new name and passport are cover for her next assignment
ili: i40911
lexfile: noun.act
part of speech: noun
hypernym: 01050836-n

01131627-v
type: LexicalConcept
in scheme: en-word.net
definition: hold within range of an aimed firearm
ili: i27248
lexfile: verb.competition
part of speech: verb
hypernym: 01130619-v
similar: 02693758-v

01150762-v
type: LexicalConcept
in scheme: en-word.net
definition: protect or defend (a position in a game)
example: he covered left field
ili: i27365
lexfile: verb.competition
part of speech: verb
hypernym: 01130619-v
similar: 01151046-v

01151046-v
type: LexicalConcept
in scheme: en-word.net
definition: be responsible for guarding an opponent in a game
ili: i27367
lexfile: verb.competition
part of speech: verb
hypernym: 01130619-v
similar: 01150762-v

01152476-v
type: LexicalConcept
in scheme: en-word.net
definition: play a higher card than the one previously played
example: Smith covered again
ili: i27374
lexfile: verb.competition
part of speech: verb
domain topic: 00489236-n
hypernym: 01151936-v

spread over-v
type: LexicalEntry
canonical form: spread over
sense: 01210571-v
part of speech: verb

01210571-v
type: LexicalConcept
in scheme: en-word.net
definition: form a cover over
example: The grass covered the grave
ili: i27662
lexfile: verb.contact
part of speech: verb
hypernym: 01208316-v
similar: 01335412-v

01335412-v
type: LexicalConcept
in scheme: en-word.net
definition: provide with a covering or cause to be covered
example: cover her face with a handkerchief
example: cover the child with a blanket
example: cover the grave with flowers
ili: i28352
lexfile: verb.contact
part of speech: verb
hypernym: 02372362-v
similar: 01339317-v
similar: 01210571-v

overlay-v
type: LexicalEntry
canonical form: overlay
sense: 01339317-v
part of speech: verb

01339317-v
type: LexicalConcept
in scheme: en-word.net
definition: put something on top of something else
example: cover the meat with a lot of gravy
ili: i28369
lexfile: verb.contact
part of speech: verb
hypernym: 01496967-v
similar: 01335412-v

breed-v
type: LexicalEntry
canonical form: breed
sense: 01433080-v
part of speech: verb

01433080-v
type: LexicalConcept
in scheme: en-word.net
definition: copulate with a female, used especially of horses
example: The horse covers the mare
ili: i28880
lexfile: verb.contact
part of speech: verb
domain topic: 00919042-n
hypernym: 01431486-v
similar: 00059956-v

shroud-v
type: LexicalEntry
canonical form: shroud
sense: 01585121-v
part of speech: verb

enshroud-v
type: LexicalEntry
canonical form: enshroud
sense: 01585121-v
part of speech: verb

hide-v
type: LexicalEntry
canonical form: hide
sense: 01585121-v
part of speech: verb

01585121-v
type: LexicalConcept
in scheme: en-word.net
definition: cover as if with a shroud
example: The origins of this civilization are shrouded in mystery
ili: i29640
lexfile: verb.contact
part of speech: verb
hypernym: 01583316-v

traverse-v
type: LexicalEntry
canonical form: traverse
sense: 01916152-v
part of speech: verb

track-v
type: LexicalEntry
canonical form: track
sense: 01916152-v
part of speech: verb

cross-v
type: LexicalEntry
canonical form: cross
sense: 01916152-v
part of speech: verb

pass over-v
type: LexicalEntry
canonical form: pass over
sense: 01916152-v
part of speech: verb

get over-v
type: LexicalEntry
canonical form: get over
sense: 01916152-v
part of speech: verb

get across-v
type: LexicalEntry
canonical form: get across
sense: 01916152-v
part of speech: verb

cut through-v
type: LexicalEntry
canonical form: cut through
sense: 01916152-v
part of speech: verb

cut across-v
type: LexicalEntry
canonical form: cut across
sense: 01916152-v
part of speech: verb

01916152-v
type: LexicalConcept
in scheme: en-word.net
definition: travel across or pass over
example: The caravan covered almost 100 miles each day
ili: i31275
lexfile: verb.motion
part of speech: verb
hypernym: 02054081-v

02151539-v
type: LexicalConcept
in scheme: en-word.net
definition: spread over a surface to conceal or protect
example: This paint covers well
ili: i32489
lexfile: verb.perception
part of speech: verb
hypernym: 02149298-v

cover up-v
type: LexicalEntry
canonical form: cover up
sense: 02152799-v
part of speech: verb

02152799-v
type: LexicalConcept
in scheme: en-word.net
definition: hide from view or knowledge
example: The President covered the fact that he bugged the offices in the White House
ili: i32496
lexfile: verb.perception
part of speech: verb
hypernym: 02149298-v

02315654-v
type: LexicalConcept
in scheme: en-word.net
definition: be sufficient to meet, defray, or offset the charge or cost of
example: Is this enough to cover the check?
ili: i33286
lexfile: verb.possession
part of speech: verb
hypernym: 02677669-v

02400142-v
type: LexicalConcept
in scheme: en-word.net
definition: to take an action to protect against future problems
example: Count the cash in the drawer twice just to cover yourself
ili: i33722
lexfile: verb.social
part of speech: verb
hypernym: 01130619-v
similar: 00892737-v

02400336-v
type: LexicalConcept
in scheme: en-word.net
definition: help out by taking someone's place and temporarily assuming their responsibilities
example: She is covering for our secretary who is ill this week
ili: i33723
lexfile: verb.social
part of speech: verb
hypernym: 02399804-v

02479869-v
type: LexicalConcept
in scheme: en-word.net
definition: invest with a large or excessive amount of something
example: She covered herself with glory
ili: i34091
lexfile: verb.social
part of speech: verb
hypernym: 02479662-v

embrace-v
type: LexicalEntry
canonical form: embrace
sense: 02635874-v
part of speech: verb

encompass-v
type: LexicalEntry
canonical form: encompass
sense: 02635874-v
part of speech: verb

comprehend-v
type: LexicalEntry
canonical form: comprehend
sense: 02635874-v
part of speech: verb

02635874-v
type: LexicalConcept
in scheme: en-word.net
definition: include in scope; include as part of something broader; have as one's sphere or territory
example: This group encompasses a wide range of people from different backgrounds
example: this should cover everyone in the group
ili: i34821
lexfile: verb.stative
part of speech: verb
hypernym: 02639021-v
similar: 01035399-v

compensate-v
type: LexicalEntry
canonical form: compensate
sense: 02678648-v
part of speech: verb

overcompensate-v
type: LexicalEntry
canonical form: overcompensate
sense: 02678648-v
part of speech: verb

02678648-v
type: LexicalConcept
in scheme: en-word.net
definition: make up for shortcomings or a feeling of inferiority by exaggerating good qualities
example: he is compensating for being a bad father
ili: i35026
lexfile: verb.stative
part of speech: verb
hypernym: 02678329-v
similar: 00892737-v

02681746-v
type: LexicalConcept
in scheme: en-word.net
definition: provide for
example: The grant doesn't cover my salary
ili: i35042
lexfile: verb.stative
part of speech: verb
hypernym: 02677669-v

continue-v
type: LexicalEntry
canonical form: continue
sense: 02693758-v
part of speech: verb

extend-v
type: LexicalEntry
canonical form: extend
sense: 02693758-v
part of speech: verb

02693758-v
type: LexicalConcept
in scheme: en-word.net
definition: span an interval of distance, space or time
example: The war extended over five years
example: The period covered the turn of the century
example: My land extends over the hills on the horizon
example: This farm covers some 200 acres
example: The Archipelago continues for another 500 miles
ili: i35093
lexfile: verb.stative
part of speech: verb
hypernym: 02661230-v
similar: 01131627-v

binding-n
type: LexicalEntry
canonical form: binding
sense: 02843848-n
part of speech: noun

book binding-n
type: LexicalEntry
canonical form: book binding
sense: 02843848-n
part of speech: noun

back-n
type: LexicalEntry
canonical form: back
sense: 02843848-n
part of speech: noun

02843848-n
type: LexicalConcept
in scheme: en-word.net
definition: the protective covering on the front, back, and spine of a book
example: the book had a leather binding
ili: i50775
lexfile: noun.artifact
part of speech: noun
hypernym: 04020673-n

blanket-n
type: LexicalEntry
canonical form: blanket
sense: 02852392-n
part of speech: noun

02852392-n
type: LexicalConcept
in scheme: en-word.net
definition: bedding that keeps a person warm in bed
example: he pulled the covers over his head and went to sleep
ili: i50831
lexfile: noun.artifact
part of speech: noun
hypernym: 02823345-n

cover version-n
type: LexicalEntry
canonical form: cover version
sense: 03126349-n
part of speech: noun

cover song-n
type: LexicalEntry
canonical form: cover song
sense: 03126349-n
part of speech: noun

03126349-n
type: LexicalConcept
in scheme: en-word.net
definition: a recording of a song that was first recorded or made popular by somebody else
example: they made a cover of a Beatles' song
ili: i52444
lexfile: noun.artifact
part of speech: noun
hypernym: 04070980-n

screen-n
type: LexicalEntry
canonical form: screen
sense: 04159023-n
part of speech: noun

covert-n
type: LexicalEntry
canonical form: covert
sense: 04159023-n
part of speech: noun

concealment-n
type: LexicalEntry
canonical form: concealment
sense: 04159023-n
part of speech: noun

04159023-n
type: LexicalConcept
in scheme: en-word.net
definition: a covering that serves to conceal or shelter something
example: a screen of trees afforded privacy
example: under cover of darkness
example: the brush provided a covert for game
example: the simplest concealment is to match perfectly the color of the background
ili: i58555
lexfile: noun.artifact
part of speech: noun
hypernym: 03127399-n

top-n
type: LexicalEntry
canonical form: top
sense: 04461181-n
part of speech: noun

04461181-n
type: LexicalConcept
in scheme: en-word.net
definition: covering for a hole (especially a hole in the top of a container)
example: he removed the top of the carton
example: he couldn't get the top off of the bottle
example: put the cover back on the kettle
ili: i60376
lexfile: noun.artifact
part of speech: noun
hypernym: 03127399-n

natural covering-n
type: LexicalEntry
canonical form: natural covering
sense: 09280855-n
part of speech: noun

09280855-n
type: LexicalConcept
in scheme: en-word.net
definition: a natural object that covers or envelops
example: under a covering of dust
example: the fox was flushed from its cover
ili: i85274
lexfile: noun.object
part of speech: noun
hypernym: 00019308-n

cover charge-n
type: LexicalEntry
canonical form: cover charge
sense: 13339433-n
part of speech: noun

13339433-n
type: LexicalConcept
in scheme: en-word.net
definition: a fixed charge by a restaurant or nightclub over and above the charge for food and drink
ili: i106685
lexfile: noun.possession
part of speech: noun
hypernym: 13339169-n