correlate-v
type: LexicalEntry
canonical form: correlate
sense: 00715901-v
part of speech: verb
sense: 02665057-v

00715901-v
type: LexicalConcept
in scheme: en-word.net
definition: bring into a mutual, complementary, or reciprocal relation
example: I cannot correlate these two pieces of information
ili: i25273
lexfile: verb.cognition
part of speech: verb
hypernym: 00715072-v
similar: 02665057-v

correlative-a
type: LexicalEntry
canonical form: correlative
sense: 01981362-s
part of speech: adjective

correlate-a
type: LexicalEntry
canonical form: correlate
sense: 01981362-s
part of speech: adjective

correlated-a
type: LexicalEntry
canonical form: correlated
sense: 01981362-s
part of speech: adjective

01981362-s
type: LexicalConcept
in scheme: en-word.net
definition: mutually related
ili: i10818
lexfile: adj.all
part of speech: adjective satellite
similar: https://en-word.net/synset/01979885-a

02665057-v
type: LexicalConcept
in scheme: en-word.net
definition: to bear a reciprocal or mutual relation
example: Do these facts correlate?
ili: i34959
lexfile: verb.stative
part of speech: verb
hypernym: 02663315-v
similar: 00715901-v

correlate-n
type: LexicalEntry
canonical form: correlate
sense: 05866991-n
part of speech: noun

correlative-n
type: LexicalEntry
canonical form: correlative
sense: 05866991-n
part of speech: noun

05866991-n
type: LexicalConcept
in scheme: en-word.net
definition: either of two or more related or complementary variables
ili: i67657
lexfile: noun.cognition
part of speech: noun
hypernym: 05866043-n