conservation-n
type: LexicalEntry
canonical form: conservation
sense: 00820935-n
part of speech: noun
sense: 06113680-n
sense: 07434199-n

00820935-n
type: LexicalConcept
in scheme: en-word.net
definition: the preservation and careful management of the environment and of natural resources
ili: i39708
lexfile: noun.act
part of speech: noun
hypernym: 00820685-n

06113680-n
type: LexicalConcept
in scheme: en-word.net
definition: (physics) the maintenance of a certain quantities unchanged during chemical reactions or physical transformations
ili: i68705
lexfile: noun.cognition
part of speech: noun
domain topic: 06100457-n
hypernym: 05881099-n

preservation-n
type: LexicalEntry
canonical form: preservation
sense: 07434199-n
part of speech: noun

07434199-n
type: LexicalConcept
in scheme: en-word.net
definition: an occurrence of improvement by virtue of preventing loss or injury or other change
ili: i75701
lexfile: noun.event
part of speech: noun
hypernym: 07371988-n