conquest-n
type: LexicalEntry
canonical form: conquest
sense: 00066036-n
part of speech: noun
sense: 00089847-n
sense: 00161352-n

00066036-n
type: LexicalConcept
in scheme: en-word.net
definition: success in mastering something difficult
example: the conquest of space
ili: i35749
lexfile: noun.act
part of speech: noun
hypernym: 00064472-n

conquering-n
type: LexicalEntry
canonical form: conquering
sense: 00089847-n
part of speech: noun

subjection-n
type: LexicalEntry
canonical form: subjection
sense: 00089847-n
part of speech: noun

subjugation-n
type: LexicalEntry
canonical form: subjugation
sense: 00089847-n
part of speech: noun

00089847-n
type: LexicalConcept
in scheme: en-word.net
definition: the act of conquering
ili: i35871
lexfile: noun.act
part of speech: noun
hypernym: 00089301-n

seduction-n
type: LexicalEntry
canonical form: seduction
sense: 00161352-n
part of speech: noun

00161352-n
type: LexicalConcept
in scheme: en-word.net
definition: an act of winning the love or sexual favor of someone
ili: i36255
lexfile: noun.act
part of speech: noun
hypernym: 00064472-n