conglomeration-n
type: LexicalEntry
canonical form: conglomeration
sense: 07389814-n
part of speech: noun
sense: 13888407-n

conglobation-n
type: LexicalEntry
canonical form: conglobation
sense: 07389814-n
part of speech: noun
sense: 13888407-n

07389814-n
type: LexicalConcept
in scheme: en-word.net
definition: an occurrence combining miscellaneous things into a (more or less) rounded mass
ili: i75444
lexfile: noun.event
part of speech: noun
hypernym: 07388403-n

13888407-n
type: LexicalConcept
in scheme: en-word.net
definition: a rounded spherical form
ili: i109790
lexfile: noun.shape
part of speech: noun
hypernym: 13921893-n