conference-n
type: LexicalEntry
canonical form: conference
sense: 07157274-n
part of speech: noun
sense: 08248105-n
sense: 08325427-n

group discussion-n
type: LexicalEntry
canonical form: group discussion
sense: 07157274-n
part of speech: noun

07157274-n
type: LexicalConcept
in scheme: en-word.net
definition: a discussion among participants who have an agreed (serious) topic
ili: i74199
lexfile: noun.communication
part of speech: noun
hypernym: 07155367-n

league-n
type: LexicalEntry
canonical form: league
sense: 08248105-n
part of speech: noun

08248105-n
type: LexicalConcept
in scheme: en-word.net
definition: an association of sports teams that organizes matches for its members
ili: i80373
lexfile: noun.group
part of speech: noun
hypernym: 08066153-n

08325427-n
type: LexicalConcept
in scheme: en-word.net
definition: a prearranged meeting for consultation or exchange of information or discussion (especially one with a formal agenda)
ili: i80796
lexfile: noun.group
part of speech: noun
hypernym: 08324519-n
mero member: 09973444-n