conspiracy-n
type: LexicalEntry
canonical form: conspiracy
sense: 06536926-n
part of speech: noun
sense: 08268224-n

confederacy-n
type: LexicalEntry
canonical form: confederacy
sense: 06536926-n
part of speech: noun
sense: 08268224-n
sense: 08320205-n

06536926-n
type: LexicalConcept
in scheme: en-word.net
definition: a secret agreement between two or more people to perform an unlawful act
ili: i70755
lexfile: noun.communication
part of speech: noun
hypernym: 06783066-n

08268224-n
type: LexicalConcept
in scheme: en-word.net
definition: a group of conspirators banded together to achieve some harmful or illegal purpose
ili: i80492
lexfile: noun.group
part of speech: noun
hypernym: 08257090-n
mero member: 09978371-n

confederation-n
type: LexicalEntry
canonical form: confederation
sense: 08320205-n
part of speech: noun

federation-n
type: LexicalEntry
canonical form: federation
sense: 08320205-n
part of speech: noun

08320205-n
type: LexicalConcept
in scheme: en-word.net
definition: a union of political organizations
ili: i80771
lexfile: noun.group
part of speech: noun
hypernym: 08321825-n