cone-v
type: LexicalEntry
canonical form: cone
sense: 01587242-v
part of speech: verb

01587242-v
type: LexicalConcept
in scheme: en-word.net
definition: make cone-shaped
example: cone a tire
ili: i29650
lexfile: verb.contact
part of speech: verb
hypernym: 01586914-v

cone-n
type: LexicalEntry
canonical form: cone
sense: 03093804-n
part of speech: noun
sense: 05463833-n
sense: 11703311-n
sense: 13895231-n

03093804-n
type: LexicalConcept
in scheme: en-word.net
definition: any cone-shaped artifact
ili: i52266
lexfile: noun.artifact
part of speech: noun
hypernym: 00022119-n

cone cell-n
type: LexicalEntry
canonical form: cone cell
sense: 05463833-n
part of speech: noun

retinal cone-n
type: LexicalEntry
canonical form: retinal cone
sense: 05463833-n
part of speech: noun

05463833-n
type: LexicalConcept
in scheme: en-word.net
definition: a visual receptor cell in the retina that is sensitive to bright light and to color
ili: i65629
lexfile: noun.body
part of speech: noun
hypernym: 05463488-n
mero part: 15113236-n

strobilus-n
type: LexicalEntry
canonical form: strobilus
sense: 11703311-n
part of speech: noun

strobile-n
type: LexicalEntry
canonical form: strobile
sense: 11703311-n
part of speech: noun

11703311-n
type: LexicalConcept
in scheme: en-word.net
definition: cone-shaped mass of ovule- or spore-bearing scales or bracts
ili: i98733
lexfile: noun.plant
part of speech: noun
hypernym: 11696293-n

conoid-n
type: LexicalEntry
canonical form: conoid
sense: 13895231-n
part of speech: noun

cone shape-n
type: LexicalEntry
canonical form: cone shape
sense: 13895231-n
part of speech: noun

13895231-n
type: LexicalConcept
in scheme: en-word.net
definition: a shape whose base is a circle and whose sides taper up to a point
ili: i109829
lexfile: noun.shape
part of speech: noun
hypernym: 13888104-n
mero part: 13925175-n