complexion-v
type: LexicalEntry
canonical form: complexion
sense: 00288610-v
part of speech: verb

00288610-v
type: LexicalConcept
in scheme: en-word.net
definition: give a certain color to
example: The setting sun complexioned the hills
ili: i23160
lexfile: verb.change
part of speech: verb
hypernym: 00287688-v

complexion-n
type: LexicalEntry
canonical form: complexion
sense: 04631646-n
part of speech: noun
sense: 04682550-n
sense: 04984219-n
sense: 06220941-n
sense: 07980938-n

04631646-n
type: LexicalConcept
in scheme: en-word.net
definition: (obsolete) a combination of elements (of dryness and warmth or of the four humors) that was once believed to determine a person's health and temperament
ili: i61375
lexfile: noun.attribute
part of speech: noun
exemplifies: 07087487-n
hypernym: 04630470-n

04682550-n
type: LexicalConcept
in scheme: en-word.net
definition: texture and appearance of the skin of the face
ili: i61624
lexfile: noun.attribute
part of speech: noun
hypernym: 04681322-n

skin color-n
type: LexicalEntry
canonical form: skin color
sense: 04984219-n
part of speech: noun

skin colour-n
type: LexicalEntry
canonical form: skin colour
sense: 04984219-n
part of speech: noun

04984219-n
type: LexicalConcept
in scheme: en-word.net
definition: the coloring of a person's face
ili: i63156
lexfile: noun.attribute
part of speech: noun
attribute: https://en-word.net/synset/00244463-a
attribute: https://en-word.net/synset/00245359-a
hypernym: 04963771-n

06220941-n
type: LexicalConcept
in scheme: en-word.net
definition: a point of view or general attitude or inclination
example: he altered the complexion of his times
example: a liberal political complexion
ili: i69172
lexfile: noun.cognition
part of speech: noun
hypernym: 06220098-n

07980938-n
type: LexicalConcept
in scheme: en-word.net
definition: a combination that results from coupling or interlinking
example: diphthongs are complexions of vowels
ili: i79175
lexfile: noun.group
part of speech: noun
hypernym: 07980325-n