competent-a
type: LexicalEntry
canonical form: competent
sense: 00051791-s
part of speech: adjective
sense: https://en-word.net/lemma/competent-a#00511975-a
sense: https://en-word.net/lemma/competent-a#00514055-a

00051791-s
type: LexicalConcept
in scheme: en-word.net
definition: adequate, but not outstanding or exceptional
example: a competent performance
ili: i266
lexfile: adj.all
part of speech: adjective satellite
similar: https://en-word.net/synset/00051265-a

https://en-word.net/synset/00511975-a
type: LexicalConcept
in scheme: en-word.net
definition: properly or sufficiently qualified or capable or efficient
example: a competent typist
ili: i2868
lexfile: adj.all
part of speech: adjective
also: https://en-word.net/synset/00307112-a
also: https://en-word.net/synset/00843158-a
also: https://en-word.net/synset/01917434-a
also: https://en-word.net/synset/02233368-a
similar: 00512273-s
similar: 00512569-s
similar: 00512962-s

https://en-word.net/synset/00514055-a
type: LexicalConcept
in scheme: en-word.net
definition: legally qualified or sufficient
example: a competent court
example: competent testimony
ili: i2876
lexfile: adj.all
part of speech: adjective