compartment-n
type: LexicalEntry
canonical form: compartment
sense: 03083745-n
part of speech: noun
sense: 03084313-n

03083745-n
type: LexicalConcept
in scheme: en-word.net
definition: a partitioned section, chamber, or separate room within a larger enclosed area
ili: i52222
lexfile: noun.artifact
part of speech: noun
hypernym: 04112987-n

03084313-n
type: LexicalConcept
in scheme: en-word.net
definition: a space into which an area is subdivided
ili: i52223
lexfile: noun.artifact
part of speech: noun
hypernym: 13933399-n