collaborate-v
type: LexicalEntry
canonical form: collaborate
sense: 02421408-v
part of speech: verb
sense: 02421881-v

join forces-v
type: LexicalEntry
canonical form: join forces
sense: 02421408-v
part of speech: verb

cooperate-v
type: LexicalEntry
canonical form: cooperate
sense: 02421408-v
part of speech: verb

02421408-v
type: LexicalConcept
in scheme: en-word.net
definition: work together on a common enterprise or project
example: The soprano and the pianist did not get together very well
example: We joined forces with another research group
ili: i33818
lexfile: verb.social
part of speech: verb
hypernym: 02418610-v
similar: 02421881-v

02421881-v
type: LexicalConcept
in scheme: en-word.net
definition: cooperate as a traitor
example: he collaborated with the Nazis when they occupied Paris
ili: i33819
lexfile: verb.social
part of speech: verb
hypernym: 02421408-v
similar: 02421408-v