coelophysis-n
type: LexicalEntry
canonical form: coelophysis
sense: 01715811-n
part of speech: noun

01715811-n
type: LexicalConcept
in scheme: en-word.net
definition: one of the oldest known dinosaurs; late Triassic; cannibalistic
ili: i44312
lexfile: noun.animal
part of speech: noun
hypernym: 01715393-n