cooperative-n
type: LexicalEntry
canonical form: cooperative
sense: 01102782-n
part of speech: noun

co-op-n
type: LexicalEntry
canonical form: co-op
sense: 01102782-n
part of speech: noun

01102782-n
type: LexicalConcept
in scheme: en-word.net
definition: a jointly owned commercial enterprise (usually organized by farmers or consumers) that produces and distributes goods and services and is run for the benefit of its owners
ili: i41165
lexfile: noun.act
part of speech: noun
hypernym: 08081929-n