clostridium-n
type: LexicalEntry
canonical form: clostridium
sense: 01359797-n
part of speech: noun

clostridia-n
type: LexicalEntry
canonical form: clostridia
sense: 01359797-n
part of speech: noun

01359797-n
type: LexicalConcept
in scheme: en-word.net
definition: spindle-shaped bacterial cell especially one swollen at the center by an endospore
ili: i42450
lexfile: noun.animal
part of speech: noun
hypernym: 01357967-n