sewer-n-1
type: LexicalEntry
canonical form: sewer
sense: 04186187-n
part of speech: noun

sewerage-n
type: LexicalEntry
canonical form: sewerage
sense: 04186187-n
part of speech: noun

cloaca-n
type: LexicalEntry
canonical form: cloaca
sense: 04186187-n
part of speech: noun
sense: 05311840-n

04186187-n
type: LexicalConcept
in scheme: en-word.net
definition: a waste pipe that carries away sewage or surface water
ili: i58711
lexfile: noun.artifact
part of speech: noun
hypernym: 03236615-n

05311840-n
type: LexicalConcept
in scheme: en-word.net
definition: (zoology) the cavity (in birds, reptiles, amphibians, most fish, and monotremes but not other mammals) at the end of the digestive tract into which the intestinal, genital, and urinary tracts open
ili: i64830
lexfile: noun.body
part of speech: noun
domain topic: 06092831-n
hypernym: 05310901-n