clean-r
type: LexicalEntry
canonical form: clean
sense: 00009835-r
part of speech: adverb
sense: 00286521-r

plumb-r
type: LexicalEntry
canonical form: plumb
sense: 00009835-r
part of speech: adverb

plum-r
type: LexicalEntry
canonical form: plum
sense: 00009835-r
part of speech: adverb

00009835-r
type: LexicalConcept
in scheme: en-word.net
definition: completely; used as intensifiers
example: clean forgot the appointment
example: I'm plumb (or plum) tuckered out
ili: i18200
lexfile: adv.all
part of speech: adverb
exemplifies: 07171981-n

cleanse-v
type: LexicalEntry
canonical form: cleanse
sense: 00035769-v
part of speech: verb

clean-v
type: LexicalEntry
canonical form: clean
sense: 00035769-v
part of speech: verb
sense: 00177724-v
sense: 00177871-v
sense: 00180982-v
sense: 01535222-v
sense: 01535377-v
sense: 01536230-v
sense: 01611610-v
sense: 01611855-v
sense: 02747835-v

00035769-v
type: LexicalConcept
in scheme: en-word.net
definition: clean one's body or parts thereof, as by washing
example: clean up before you see your grandparents
example: clean your fingernails before dinner
ili: i21945
lexfile: verb.body
part of speech: verb
hypernym: 00040084-v

clean-a
type: LexicalEntry
canonical form: clean
sense: 00047873-s
part of speech: adjective
sense: 00061923-s
sense: 00144562-s
sense: https://en-word.net/lemma/clean-a#00418932-a
sense: https://en-word.net/lemma/clean-a#00425527-a
sense: https://en-word.net/lemma/clean-a#00427844-a
sense: https://en-word.net/lemma/clean-a#00428828-a
sense: 00524165-s
sense: 00753551-s
sense: 00959923-s
sense: 01090782-s
sense: 01407924-s
sense: 01552957-s
sense: 01754399-s
sense: 01912517-s
sense: 01912661-s
sense: 01920489-s
sense: 02123753-s

00047873-s
type: LexicalConcept
in scheme: en-word.net
definition: free of drugs
example: after a long dependency on heroin she has been clean for 4 years
ili: i246
lexfile: adj.all
part of speech: adjective satellite
similar: https://en-word.net/synset/00047786-a

neat-a
type: LexicalEntry
canonical form: neat
sense: 00061923-s
part of speech: adjective

00061923-s
type: LexicalConcept
in scheme: en-word.net
definition: free from clumsiness; precisely or deftly executed
example: he landed a clean left on his opponent's cheek
example: a clean throw
example: the neat exactness of the surgeon's knife
ili: i327
lexfile: adj.all
part of speech: adjective satellite
similar: https://en-word.net/synset/00061521-a

00144562-s
type: LexicalConcept
in scheme: en-word.net
definition: not carrying concealed weapons
ili: i772
lexfile: adj.all
part of speech: adjective satellite
similar: https://en-word.net/synset/00144185-a

pick-v
type: LexicalEntry
canonical form: pick
sense: 00177724-v
part of speech: verb

00177724-v
type: LexicalConcept
in scheme: en-word.net
definition: remove unwanted substances from, such as feathers or pits
example: Clean the turkey
ili: i22590
lexfile: verb.change
part of speech: verb
hypernym: 00173351-v

00177871-v
type: LexicalConcept
in scheme: en-word.net
definition: remove shells or husks from
example: clean grain before milling it
ili: i22591
lexfile: verb.change
part of speech: verb
hypernym: 00173351-v

scavenge-v
type: LexicalEntry
canonical form: scavenge
sense: 00180982-v
part of speech: verb

00180982-v
type: LexicalConcept
in scheme: en-word.net
definition: remove unwanted substances from
ili: i22613
lexfile: verb.change
part of speech: verb
domain topic: 06094057-n
hypernym: 00173351-v

fairly-r
type: LexicalEntry
canonical form: fairly
sense: 00286521-r
part of speech: adverb

fair-r
type: LexicalEntry
canonical form: fair
sense: 00286521-r
part of speech: adverb

00286521-r
type: LexicalConcept
in scheme: en-word.net
definition: in conformity with the rules or laws and without fraud or cheating
example: they played fairly
ili: i20135
lexfile: adv.all
part of speech: adverb

https://en-word.net/synset/00418932-a
type: LexicalConcept
in scheme: en-word.net
definition: free from dirt or impurities; or having clean habits
example: children with clean shining faces
example: clean white shirts
example: clean dishes
example: a spotlessly clean house
example: cats are clean animals
ili: i2367
lexfile: adj.all
part of speech: adjective
also: https://en-word.net/synset/02122604-a
also: https://en-word.net/synset/02431459-a
also: https://en-word.net/synset/00428828-a
attribute: 14519777-n
similar: 00419417-s
similar: 00419497-s
similar: 00419629-s
similar: 00419717-s
similar: 00419883-s
similar: 00420198-s
similar: 00420328-s
similar: 00420469-s
similar: 00420577-s
similar: 00420694-s

unobjectionable-a
type: LexicalEntry
canonical form: unobjectionable
sense: https://en-word.net/lemma/unobjectionable-a#00425527-a
part of speech: adjective

https://en-word.net/synset/00425527-a
type: LexicalConcept
in scheme: en-word.net
definition: (of behavior or especially language) free from objectionable elements; fit for all observers
example: good clean fun
example: a clean joke
ili: i2403
lexfile: adj.all
part of speech: adjective
also: https://en-word.net/synset/00686209-a
similar: 00425759-s

uncontaminating-a
type: LexicalEntry
canonical form: uncontaminating
sense: https://en-word.net/lemma/uncontaminating-a#00427844-a
part of speech: adjective

https://en-word.net/synset/00427844-a
type: LexicalConcept
in scheme: en-word.net
definition: not spreading pollution or contamination; especially radioactive contamination
example: a clean fuel
example: cleaner and more efficient engines
example: the tactical bomb is reasonably clean
ili: i2414
lexfile: adj.all
part of speech: adjective

https://en-word.net/synset/00428828-a
type: LexicalConcept
in scheme: en-word.net
definition: ritually clean or pure
ili: i2419
lexfile: adj.all
part of speech: adjective
also: https://en-word.net/synset/00418932-a
also: https://en-word.net/synset/01911832-a
domain topic: 05955536-n
similar: 00428993-s
similar: 00429141-s

00524165-s
type: LexicalConcept
in scheme: en-word.net
definition: thorough and without qualification
example: a clean getaway
example: a clean sweep
example: a clean break
ili: i2928
lexfile: adj.all
part of speech: adjective satellite
similar: https://en-word.net/synset/00522139-a

clean and jerk-n
type: LexicalEntry
canonical form: clean and jerk
sense: 00628078-n
part of speech: noun

clean-n
type: LexicalEntry
canonical form: clean
sense: 00628078-n
part of speech: noun

00628078-n
type: LexicalConcept
in scheme: en-word.net
definition: a weightlift in which the barbell is lifted to shoulder height and then jerked overhead
ili: i38717
lexfile: noun.act
part of speech: noun
hypernym: 00627428-n
mero part: 00627663-n

00753551-s
type: LexicalConcept
in scheme: en-word.net
definition: without difficulties or problems
example: a clean test flight
ili: i4149
lexfile: adj.all
part of speech: adjective satellite
similar: https://en-word.net/synset/00752852-a

sporting-a
type: LexicalEntry
canonical form: sporting
sense: 00959923-s
part of speech: adjective

sporty-a
type: LexicalEntry
canonical form: sporty
sense: 00959923-s
part of speech: adjective

sportsmanlike-a
type: LexicalEntry
canonical form: sportsmanlike
sense: 00959923-s
part of speech: adjective

00959923-s
type: LexicalConcept
in scheme: en-word.net
definition: exhibiting or calling for sportsmanship or fair play
example: a clean fight
example: a sporting solution of the disagreement
example: sportsmanlike conduct
ili: i5247
lexfile: adj.all
part of speech: adjective satellite
similar: https://en-word.net/synset/00959321-a

blank-a
type: LexicalEntry
canonical form: blank
sense: 01090782-s
part of speech: adjective

white-a
type: LexicalEntry
canonical form: white
sense: 01090782-s
part of speech: adjective

01090782-s
type: LexicalConcept
in scheme: en-word.net
definition: (of a surface) not written or printed on
example: blank pages
example: fill in the blank spaces
example: a clean page
example: wide white margins
ili: i5970
lexfile: adj.all
part of speech: adjective satellite
similar: https://en-word.net/synset/01090234-a

fair-a
type: LexicalEntry
canonical form: fair
sense: 01407924-s
part of speech: adjective

01407924-s
type: LexicalConcept
in scheme: en-word.net
definition: (of a manuscript) having few alterations or corrections
example: fair copy
example: a clean manuscript
ili: i7663
lexfile: adj.all
part of speech: adjective satellite
similar: https://en-word.net/synset/01407728-a

01535222-v
type: LexicalConcept
in scheme: en-word.net
definition: remove while making clean
example: Clean the spots off the rug
ili: i29394
lexfile: verb.contact
part of speech: verb
hypernym: 00173351-v
similar: 01536230-v

make clean-v
type: LexicalEntry
canonical form: make clean
sense: 01535377-v
part of speech: verb

01535377-v
type: LexicalConcept
in scheme: en-word.net
definition: make clean by removing dirt, filth, or unwanted substances from
example: Clean the stove!
example: The dentist cleaned my teeth
ili: i29395
lexfile: verb.contact
part of speech: verb
hypernym: 00126072-v
similar: 01536230-v
similar: 02747835-v

houseclean-v
type: LexicalEntry
canonical form: houseclean
sense: 01536230-v
part of speech: verb

clean house-v
type: LexicalEntry
canonical form: clean house
sense: 01536230-v
part of speech: verb

01536230-v
type: LexicalConcept
in scheme: en-word.net
definition: clean and tidy up the house
example: She housecleans every week
ili: i29398
lexfile: verb.contact
part of speech: verb
hypernym: 00276642-v
similar: 01535222-v
similar: 01535377-v

clean-living-a
type: LexicalEntry
canonical form: clean-living
sense: 01552957-s
part of speech: adjective

01552957-s
type: LexicalConcept
in scheme: en-word.net
definition: morally pure
example: led a clean life
ili: i8505
lexfile: adj.all
part of speech: adjective satellite
similar: https://en-word.net/synset/01552360-a

strip-v
type: LexicalEntry
canonical form: strip
sense: 01611610-v
part of speech: verb

01611610-v
type: LexicalConcept
in scheme: en-word.net
definition: remove all contents or possession from, or empty completely
example: The boys cleaned the sandwich platters
example: The trees were cleaned of apples by the storm
ili: i29798
lexfile: verb.contact
part of speech: verb
hypernym: 00173351-v

01611855-v
type: LexicalConcept
in scheme: en-word.net
definition: deprive wholly of money in a gambling game, robbery, etc.
example: The other players cleaned him completely
ili: i29799
lexfile: verb.contact
part of speech: verb
hypernym: 02319255-v

01754399-s
type: LexicalConcept
in scheme: en-word.net
definition: (of a record) having no marks of discredit or offense
example: a clean voting record
example: a clean driver's license
ili: i9603
lexfile: adj.all
part of speech: adjective satellite
similar: https://en-word.net/synset/01753804-a

fresh-a
type: LexicalEntry
canonical form: fresh
sense: 01912517-s
part of speech: adjective

01912517-s
type: LexicalConcept
in scheme: en-word.net
definition: free from impurities
example: clean water
example: fresh air
ili: i10450
lexfile: adj.all
part of speech: adjective satellite
similar: https://en-word.net/synset/01911832-a

clear-a
type: LexicalEntry
canonical form: clear
sense: 01912661-s
part of speech: adjective
sense: 01920489-s

light-a
type: LexicalEntry
canonical form: light
sense: 01912661-s
part of speech: adjective

unclouded-a
type: LexicalEntry
canonical form: unclouded
sense: 01912661-s
part of speech: adjective

01912661-s
type: LexicalConcept
in scheme: en-word.net
definition: (of sound or color) free from anything that dulls or dims
example: efforts to obtain a clean bass in orchestral recordings
example: clear laughter like a waterfall
example: clear reds and blues
example: a light lilting voice like a silver bell
ili: i10451
lexfile: adj.all
part of speech: adjective satellite
similar: https://en-word.net/synset/01911832-a

01920489-s
type: LexicalConcept
in scheme: en-word.net
definition: free of restrictions or qualifications
example: a clean bill of health
example: a clear winner
ili: i10497
lexfile: adj.all
part of speech: adjective satellite
similar: https://en-word.net/synset/01920096-a

uninfected-a
type: LexicalEntry
canonical form: uninfected
sense: 02123753-s
part of speech: adjective

02123753-s
type: LexicalConcept
in scheme: en-word.net
definition: free from sepsis or infection
example: a clean (or uninfected) wound
ili: i11594
lexfile: adj.all
part of speech: adjective satellite
similar: https://en-word.net/synset/02122604-a

02747835-v
type: LexicalConcept
in scheme: en-word.net
definition: be cleanable
example: This stove cleans easily
ili: i35381
lexfile: verb.stative
part of speech: verb
hypernym: 02609706-v
similar: 01535377-v