pottery-n
type: LexicalEntry
canonical form: pottery
sense: 03999061-n
part of speech: noun

clayware-n
type: LexicalEntry
canonical form: clayware
sense: 03999061-n
part of speech: noun

03999061-n
type: LexicalConcept
in scheme: en-word.net
definition: ceramic ware made from clay and baked in a kiln
ili: i57608
lexfile: noun.artifact
part of speech: noun
hypernym: 03001214-n
mero substance: 14837352-n