ciprofloxacin-n
type: LexicalEntry
canonical form: ciprofloxacin
sense: 03036561-n
part of speech: noun

Cipro-n
type: LexicalEntry
canonical form: Cipro
sense: 03036561-n
part of speech: noun

03036561-n
type: LexicalConcept
in scheme: en-word.net
definition: an oral antibiotic (trade name Cipro) used against serious bacterial infections of the skin or respiratory tract or urinary tract or bones or joints
ili: i51942
lexfile: noun.artifact
part of speech: noun
hypernym: 02719777-n