chokepoint-n
type: LexicalEntry
canonical form: chokepoint
sense: 08561339-n
part of speech: noun
sense: 13936007-n

08561339-n
type: LexicalConcept
in scheme: en-word.net
definition: a point of congestion or blockage
example: the bridge is always a chokepoint at rush hour
ili: i81881
lexfile: noun.location
part of speech: noun
hypernym: 08637636-n

constriction-n
type: LexicalEntry
canonical form: constriction
sense: 13936007-n
part of speech: noun

bottleneck-n
type: LexicalEntry
canonical form: bottleneck
sense: 13936007-n
part of speech: noun

13936007-n
type: LexicalConcept
in scheme: en-word.net
definition: a narrowing that reduces the flow through a channel
ili: i110058
lexfile: noun.shape
part of speech: noun
hypernym: 05078196-n