chlorhexidine-n
type: LexicalEntry
canonical form: chlorhexidine
sense: 03025933-n
part of speech: noun

03025933-n
type: LexicalConcept
in scheme: en-word.net
definition: a long-lasting liquid antiseptic; used by surgeons to wash their hands before performing surgery
ili: i51878
lexfile: noun.artifact
part of speech: noun
hypernym: 02727132-n