affinity-n
type: LexicalEntry
canonical form: affinity
sense: 11442936-n
part of speech: noun

chemical attraction-n
type: LexicalEntry
canonical form: chemical attraction
sense: 11442936-n
part of speech: noun

11442936-n
type: LexicalConcept
in scheme: en-word.net
definition: the force attracting atoms to each other and binding them together in a molecule
example: basic dyes have an affinity for wool and silk
ili: i97610
lexfile: noun.phenomenon
part of speech: noun
hypernym: 11479041-n