checkmate-n
type: LexicalEntry
canonical form: checkmate
sense: 00168585-n
part of speech: noun
sense: 07490175-n

mate-n
type: LexicalEntry
canonical form: mate
sense: 00168585-n
part of speech: noun

00168585-n
type: LexicalConcept
in scheme: en-word.net
definition: a chess move constituting an inescapable and indefensible attack on the opponent's king
ili: i36291
lexfile: noun.act
part of speech: noun
hypernym: 00167176-n

checkmate-v
type: LexicalEntry
canonical form: checkmate
sense: 01116893-v
part of speech: verb

mate-v
type: LexicalEntry
canonical form: mate
sense: 01116893-v
part of speech: verb

01116893-v
type: LexicalConcept
in scheme: en-word.net
definition: place an opponent's king under an attack from which it cannot escape and thus ending the game
example: Kasparov checkmated his opponent after only a few moves
ili: i27170
lexfile: verb.competition
part of speech: verb
domain topic: 00504248-n
hypernym: 01104324-v

07490175-n
type: LexicalConcept
in scheme: en-word.net
definition: complete victory
ili: i76013
lexfile: noun.event
part of speech: noun
hypernym: 07488581-n